{"text_format":"1","workbook":"xlsx","n_sheets":65,"sheets":["Intro","Balance sheet","P and L","Cash Flow","LOB Analysis","Nationwide Premium Volume","Warning","Authorized Premium by LOB (Agg)","ST","AK","AL","AR","AS","AZ","CA","CO","CT","DC","DE","FL","GA","GU","HI","IA","ID","IL","IN","KS","KY","LA","MA","MD","ME","MI","MN","MO","MS","MT","NC","ND","NE","NH","NJ","NM","NV","NY","OH","OK","OR","PA","PR","RI","SC","SD","TN","TX","UT","VA","VI","VT","WA","WI","WV","WY","Assumptions"],"not_rendered":{"charts":0,"images":1,"macros":1,"external_links":0,"defined_names":6,"comments":0,"pivot_tables":0},"unopened":[],"bounds":{"document_bytes":16777216,"sheet_cells":100000,"rows_first":2000,"rows_last":500,"rows_between":2000,"halvings":0,"cell_chars":16384,"cell_head_chars":4096},"cells_cut":0,"cells_raw":0,"read":"whole","date_system":"1900"}

{"sheet":"Intro","index":0,"n_rows":59,"n_cols":20,"rows_kept":59,"cut":false,"hidden":false,"merged":[]}
[null,null,null,null,null,null,null,null,null,null,null,null,false]
[null,null,null,null,null,null,null,null,null,null,null,null,false,"AK","Alaska",{"$f":"IF(TRIM(M2)=\"TRUE\",N2,\"Z\")","v":"Z"},"NC"]
[null,null,null,null,null,null,null,null,null,null,null,null,false,"AL","Alabama",{"$f":"IF(TRIM(M3)=\"TRUE\",N3,\"Z\")","v":"Z"},"PR","Current"]
[null,null,null,null,null,null,null,null,null,null,null,null,false]
[null,null,null,"AK","Alaska",null,null,"MT","Montana",null,null,null,false,"AR","Arkansas","Z","TN",null,"Alaska","Go to AK"]
[null,null,null,"AL","Alabama",null,null,"NC","North Carolina",null,null,null,false,"AS","American Samoa","Z","WI",null,"Alabama","Go to AL"]
{"$rows_left_out":54}
{"sheet":"Balance sheet","index":1,"n_rows":39,"n_cols":9,"rows_kept":39,"cut":false,"hidden":false,"merged":[[36,0,36,8]]}
[{"$f":"Intro!B22","v":"Applicant Company Name"}]
["(Health Company)"]
["Pro Forma Statutory Balance Sheet (Nationwide)"]
["(In Whole Numbers)"]
[null,null,null,null,{"$f":"Intro!B24","v":0},null,{"$f":"Intro!B26","v":1},null,{"$f":"Intro!B28","v":2}]
[null,"Admitted Assets"]
{"$rows_left_out":34}
{"sheet":"P and L","index":2,"n_rows":45,"n_cols":10,"rows_kept":45,"cut":false,"hidden":false,"merged":[]}
[{"$f":"Intro!B22","v":"Applicant Company Name"}]
["(Health Company)"]
["Pro Forma Statutory Profit & Loss Statement (Nationwide)"]
["(In Whole Numbers)"]
[null,null,null,null,null,{"$f":"Intro!B24","v":0},null,{"$f":"Intro!B26","v":1},null,{"$f":"Intro!B28","v":2}]
["1.","Member Months"]
{"$rows_left_out":40}
{"sheet":"Cash Flow","index":3,"n_rows":30,"n_cols":8,"rows_kept":30,"cut":false,"hidden":false,"merged":[]}
[{"$f":"Intro!B22","v":"Applicant Company Name"}]
["(Health Company)"]
["Pro Forma Statutory Cash Flow Statement"]
["(In Whole Numbers)"]
[]
[null,null,null,{"$f":"Intro!B24","v":0},null,{"$f":"Intro!B26","v":1},null,{"$f":"Intro!B28","v":2}]
{"$rows_left_out":25}
{"sheet":"LOB Analysis","index":4,"n_rows":85,"n_cols":12,"rows_kept":85,"cut":false,"hidden":false,"merged":[]}
[{"$f":"Intro!B22","v":"Applicant Company Name"}]
["(Health Company)"]
["Analysis of Operations by Line of Business"]
["(In Whole Numbers)"]
[]
["Nationwide"]
{"$rows_left_out":80}
{"sheet":"Nationwide Premium Volume","index":5,"n_rows":51,"n_cols":15,"rows_kept":51,"cut":false,"hidden":false,"merged":[[0,0,0,1],[1,0,1,1],[2,0,2,1],[3,0,3,1],[5,0,5,9]]}
[{"$f":"Intro!B22","v":"Applicant Company Name"}]
["(Health Company)"]
["Planned Premium Volume by Line of Business"]
["(Amounts in Whole Dollars)"]
[]
["The Nationwide page will include projected premiums by line of business for a three year period for those states in which the company is already licensed and authorized to write business and three years of projected premiums by line of business for those states in which the company is applying to be licensed and authorized. The projected premiums for the lines of business in those states in which the company is authorized to write will be pulled in from the Authorized Premium By LOB tab and the projected premiums for the lines of business in which the Applicant Company is applying for will pull in from the individual state tabs.            \n                  \n"]
{"$rows_left_out":46}
{"sheet":"Warning","index":6,"n_rows":25,"n_cols":11,"rows_kept":25,"cut":false,"hidden":true,"merged":[[0,0,0,10]]}
["Are you sure you want to delete the selected states?"]
[]
[]
[]
[{"$f":"IF(Intro!M2=TRUE,\"X\",\"\")","v":""},"AK","Alaska",null,{"$f":"IF(Intro!M21=TRUE,\"X\",\"\")","v":""},"KS","Kansas",null,{"$f":"IF(Intro!M40=TRUE,\"X\",\"\")","v":""},"OH","Ohio"]
[{"$f":"IF(Intro!M3=TRUE,\"X\",\"\")","v":""},"AL","Alabama",null,{"$f":"IF(Intro!M22=TRUE,\"X\",\"\")","v":""},"KY","Kentucky",null,{"$f":"IF(Intro!M41=TRUE,\"X\",\"\")","v":""},"OK","Oklahoma"]
{"$rows_left_out":20}
{"sheet":"Authorized Premium by LOB (Agg)","index":7,"n_rows":49,"n_cols":15,"rows_kept":49,"cut":false,"hidden":false,"merged":[[0,0,0,1],[1,0,1,1],[3,0,3,1],[2,0,2,5]]}
[{"$f":"Intro!B22","v":"Applicant Company Name"}]
["(Health Company)"]
["Authorized Premium by LOB (Aggregate) - Planned Premium Volume by Line of Business"]
["(Amounts in Whole Dollars)"]
[]
["Nationwide"]
{"$rows_left_out":44}
{"sheet":"ST","index":8,"n_rows":51,"n_cols":13,"rows_kept":51,"cut":false,"hidden":true,"merged":[]}
[]
[{"$f":"Intro!B22","v":"Applicant Company Name"}]
["(Health Company)"]
["Planned Premium Volume by Line of Business"]
["(Amounts in Whole Dollars)"]
[]
{"$rows_left_out":46}
{"sheet":"AK","index":9,"n_rows":49,"n_cols":13,"rows_kept":49,"cut":false,"hidden":true,"merged":[]}
[{"$f":"Intro!B22","v":"Applicant Company Name"}]
["(Health Company)"]
["Planned Premium Volume by Line of Business"]
["(Amounts in Whole Dollars)"]
[]
[{"$f":"Intro!E5","v":"Alaska"}]
{"$rows_left_out":44}
{"sheet":"AL","index":10,"n_rows":49,"n_cols":13,"rows_kept":49,"cut":false,"hidden":true,"merged":[]}
[{"$f":"Intro!B22","v":"Applicant Company Name"}]
["(Health Company)"]
["Planned Premium Volume by Line of Business"]
["(Amounts in Whole Dollars)"]
[]
[{"$f":"Intro!E6","v":"Alabama"}]
{"$rows_left_out":44}
{"sheet":"AR","index":11,"n_rows":49,"n_cols":13,"rows_kept":49,"cut":false,"hidden":true,"merged":[]}
[{"$f":"Intro!B22","v":"Applicant Company Name"}]
["(Health Company)"]
["Planned Premium Volume by Line of Business"]
["(Amounts in Whole Dollars)"]
[]
[{"$f":"Intro!E7","v":"Arkansas"}]
{"$rows_left_out":44}
{"sheet":"AS","index":12,"n_rows":49,"n_cols":13,"rows_kept":49,"cut":false,"hidden":true,"merged":[]}
[{"$f":"Intro!B22","v":"Applicant Company Name"}]
["(Health Company)"]
["Planned Premium Volume by Line of Business"]
["(Amounts in Whole Dollars)"]
[]
[{"$f":"Intro!E8","v":"American Samoa"}]
{"$rows_left_out":44}
{"sheet":"AZ","index":13,"n_rows":49,"n_cols":13,"rows_kept":49,"cut":false,"hidden":true,"merged":[]}
[{"$f":"Intro!B22","v":"Applicant Company Name"}]
["(Health Company)"]
["Planned Premium Volume by Line of Business"]
["(Amounts in Whole Dollars)"]
[]
[{"$f":"Intro!E9","v":"Arizona"}]
{"$rows_left_out":44}
{"sheet":"CA","index":14,"n_rows":49,"n_cols":13,"rows_kept":49,"cut":false,"hidden":true,"merged":[]}
[{"$f":"Intro!B22","v":"Applicant Company Name"}]
["(Health Company)"]
["Planned Premium Volume by Line of Business"]
["(Amounts in Whole Dollars)"]
[]
[{"$f":"Intro!E10","v":"California"}]
{"$rows_left_out":44}
{"sheet":"CO","index":15,"n_rows":49,"n_cols":13,"rows_kept":49,"cut":false,"hidden":true,"merged":[]}
[{"$f":"Intro!B22","v":"Applicant Company Name"}]
["(Health Company)"]
["Planned Premium Volume by Line of Business"]
["(Amounts in Whole Dollars)"]
[]
[{"$f":"Intro!E11","v":"Colorado"}]
{"$rows_left_out":44}
{"sheet":"CT","index":16,"n_rows":49,"n_cols":13,"rows_kept":49,"cut":false,"hidden":true,"merged":[]}
[{"$f":"Intro!B22","v":"Applicant Company Name"}]
["(Health Company)"]
["Planned Premium Volume by Line of Business"]
["(Amounts in Whole Dollars)"]
[]
[{"$f":"Intro!E12","v":"Connecticut"}]
{"$rows_left_out":44}
{"sheet":"DC","index":17,"n_rows":49,"n_cols":13,"rows_kept":49,"cut":false,"hidden":true,"merged":[]}
[{"$f":"Intro!B22","v":"Applicant Company Name"}]
["(Health Company)"]
["Planned Premium Volume by Line of Business"]
["(Amounts in Whole Dollars)"]
[]
[{"$f":"Intro!E13","v":"District Of Columbia"}]
{"$rows_left_out":44}
{"sheet":"DE","index":18,"n_rows":49,"n_cols":13,"rows_kept":49,"cut":false,"hidden":true,"merged":[]}
[{"$f":"Intro!B22","v":"Applicant Company Name"}]
["(Health Company)"]
["Planned Premium Volume by Line of Business"]
["(Amounts in Whole Dollars)"]
[]
[{"$f":"Intro!E14","v":"Delaware"}]
{"$rows_left_out":44}
{"sheet":"FL","index":19,"n_rows":49,"n_cols":13,"rows_kept":49,"cut":false,"hidden":true,"merged":[]}
[{"$f":"Intro!B22","v":"Applicant Company Name"}]
["(Health Company)"]
["Planned Premium Volume by Line of Business"]
["(Amounts in Whole Dollars)"]
[]
[{"$f":"Intro!E15","v":"Florida"}]
{"$rows_left_out":44}
{"sheet":"GA","index":20,"n_rows":49,"n_cols":13,"rows_kept":49,"cut":false,"hidden":true,"merged":[]}
[{"$f":"Intro!B22","v":"Applicant Company Name"}]
["(Health Company)"]
["Planned Premium Volume by Line of Business"]
["(Amounts in Whole Dollars)"]
[]
[{"$f":"Intro!E16","v":"Georgia"}]
{"$rows_left_out":44}
{"sheet":"GU","index":21,"n_rows":49,"n_cols":13,"rows_kept":49,"cut":false,"hidden":true,"merged":[]}
[{"$f":"Intro!B22","v":"Applicant Company Name"}]
["(Health Company)"]
["Planned Premium Volume by Line of Business"]
["(Amounts in Whole Dollars)"]
[]
[{"$f":"Intro!E17","v":"Guam"}]
{"$rows_left_out":44}
{"sheet":"HI","index":22,"n_rows":49,"n_cols":13,"rows_kept":49,"cut":false,"hidden":true,"merged":[]}
[{"$f":"Intro!B22","v":"Applicant Company Name"}]
["(Health Company)"]
["Planned Premium Volume by Line of Business"]
["(Amounts in Whole Dollars)"]
[]
[{"$f":"Intro!E18","v":"Hawaii"}]
{"$rows_left_out":44}
{"sheet":"IA","index":23,"n_rows":49,"n_cols":13,"rows_kept":49,"cut":false,"hidden":true,"merged":[]}
[{"$f":"Intro!B22","v":"Applicant Company Name"}]
["(Health Company)"]
["Planned Premium Volume by Line of Business"]
["(Amounts in Whole Dollars)"]
[]
[{"$f":"Intro!E19","v":"Iowa"}]
{"$rows_left_out":44}
{"sheet":"ID","index":24,"n_rows":49,"n_cols":13,"rows_kept":49,"cut":false,"hidden":true,"merged":[]}
[{"$f":"Intro!B22","v":"Applicant Company Name"}]
["(Health Company)"]
["Planned Premium Volume by Line of Business"]
["(Amounts in Whole Dollars)"]
[]
[{"$f":"Intro!E20","v":"Idaho"}]
{"$rows_left_out":44}
{"sheet":"IL","index":25,"n_rows":49,"n_cols":13,"rows_kept":49,"cut":false,"hidden":true,"merged":[]}
[{"$f":"Intro!B22","v":"Applicant Company Name"}]
["(Health Company)"]
["Planned Premium Volume by Line of Business"]
["(Amounts in Whole Dollars)"]
[]
[{"$f":"Intro!E21","v":"Illinois"}]
{"$rows_left_out":44}
{"sheet":"IN","index":26,"n_rows":49,"n_cols":13,"rows_kept":49,"cut":false,"hidden":true,"merged":[]}
[{"$f":"Intro!B22","v":"Applicant Company Name"}]
["(Health Company)"]
["Planned Premium Volume by Line of Business"]
["(Amounts in Whole Dollars)"]
[]
[{"$f":"Intro!E22","v":"Indiana"}]
{"$rows_left_out":44}
{"sheet":"KS","index":27,"n_rows":49,"n_cols":13,"rows_kept":49,"cut":false,"hidden":true,"merged":[]}
[{"$f":"Intro!B22","v":"Applicant Company Name"}]
["(Health Company)"]
["Planned Premium Volume by Line of Business"]
["(Amounts in Whole Dollars)"]
[]
[{"$f":"Intro!E23","v":"Kansas"}]
{"$rows_left_out":44}
{"sheet":"KY","index":28,"n_rows":49,"n_cols":13,"rows_kept":49,"cut":false,"hidden":true,"merged":[]}
[{"$f":"Intro!B22","v":"Applicant Company Name"}]
["(Health Company)"]
["Planned Premium Volume by Line of Business"]
["(Amounts in Whole Dollars)"]
[]
[{"$f":"Intro!E24","v":"Kentucky"}]
{"$rows_left_out":44}
{"sheet":"LA","index":29,"n_rows":49,"n_cols":13,"rows_kept":49,"cut":false,"hidden":true,"merged":[]}
[{"$f":"Intro!B22","v":"Applicant Company Name"}]
["(Health Company)"]
["Planned Premium Volume by Line of Business"]
["(Amounts in Whole Dollars)"]
[]
[{"$f":"Intro!E25","v":"Louisiana"}]
{"$rows_left_out":44}
{"sheet":"MA","index":30,"n_rows":49,"n_cols":13,"rows_kept":49,"cut":false,"hidden":true,"merged":[]}
[{"$f":"Intro!B22","v":"Applicant Company Name"}]
["(Health Company)"]
["Planned Premium Volume by Line of Business"]
["(Amounts in Whole Dollars)"]
[]
[{"$f":"Intro!E26","v":"Massachusetts"}]
{"$rows_left_out":44}
{"sheet":"MD","index":31,"n_rows":49,"n_cols":13,"rows_kept":49,"cut":false,"hidden":true,"merged":[]}
[{"$f":"Intro!B22","v":"Applicant Company Name"}]
["(Health Company)"]
["Planned Premium Volume by Line of Business"]
["(Amounts in Whole Dollars)"]
[]
[{"$f":"Intro!E27","v":"Maryland"}]
{"$rows_left_out":44}
{"sheet":"ME","index":32,"n_rows":49,"n_cols":13,"rows_kept":49,"cut":false,"hidden":true,"merged":[]}
[{"$f":"Intro!B22","v":"Applicant Company Name"}]
["(Health Company)"]
["Planned Premium Volume by Line of Business"]
["(Amounts in Whole Dollars)"]
[]
[{"$f":"Intro!E28","v":"Maine"}]
{"$rows_left_out":44}
{"sheet":"MI","index":33,"n_rows":49,"n_cols":13,"rows_kept":49,"cut":false,"hidden":true,"merged":[]}
[{"$f":"Intro!B22","v":"Applicant Company Name"}]
["(Health Company)"]
["Planned Premium Volume by Line of Business"]
["(Amounts in Whole Dollars)"]
[]
[{"$f":"Intro!E29","v":"Michigan"}]
{"$rows_left_out":44}
{"sheet":"MN","index":34,"n_rows":49,"n_cols":13,"rows_kept":49,"cut":false,"hidden":true,"merged":[]}
[{"$f":"Intro!B22","v":"Applicant Company Name"}]
["(Health Company)"]
["Planned Premium Volume by Line of Business"]
["(Amounts in Whole Dollars)"]
[]
[{"$f":"Intro!E30","v":"Minnesota"}]
{"$rows_left_out":44}
{"sheet":"MO","index":35,"n_rows":49,"n_cols":13,"rows_kept":49,"cut":false,"hidden":true,"merged":[]}
[{"$f":"Intro!B22","v":"Applicant Company Name"}]
["(Health Company)"]
["Planned Premium Volume by Line of Business"]
["(Amounts in Whole Dollars)"]
[]
[{"$f":"Intro!E31","v":"Missouri"}]
{"$rows_left_out":44}
{"sheet":"MS","index":36,"n_rows":49,"n_cols":13,"rows_kept":49,"cut":false,"hidden":true,"merged":[]}
[{"$f":"Intro!B22","v":"Applicant Company Name"}]
["(Health Company)"]
["Planned Premium Volume by Line of Business"]
["(Amounts in Whole Dollars)"]
[]
[{"$f":"Intro!E32","v":"Mississippi"}]
{"$rows_left_out":44}
{"sheet":"MT","index":37,"n_rows":49,"n_cols":13,"rows_kept":49,"cut":false,"hidden":true,"merged":[]}
[{"$f":"Intro!B22","v":"Applicant Company Name"}]
["(Health Company)"]
["Planned Premium Volume by Line of Business"]
["(Amounts in Whole Dollars)"]
[]
[{"$f":"Intro!I5","v":"Montana"}]
{"$rows_left_out":44}
{"sheet":"NC","index":38,"n_rows":49,"n_cols":13,"rows_kept":49,"cut":false,"hidden":true,"merged":[]}
[{"$f":"Intro!B22","v":"Applicant Company Name"}]
["(Health Company)"]
["Planned Premium Volume by Line of Business"]
["(Amounts in Whole Dollars)"]
[]
[{"$f":"Intro!I6","v":"North Carolina"}]
{"$rows_left_out":44}
{"sheet":"ND","index":39,"n_rows":49,"n_cols":13,"rows_kept":49,"cut":false,"hidden":true,"merged":[]}
[{"$f":"Intro!B22","v":"Applicant Company Name"}]
["(Health Company)"]
["Planned Premium Volume by Line of Business"]
["(Amounts in Whole Dollars)"]
[]
[{"$f":"Intro!I7","v":"North Dakota"}]
{"$rows_left_out":44}
{"sheet":"NE","index":40,"n_rows":49,"n_cols":13,"rows_kept":49,"cut":false,"hidden":true,"merged":[]}
[{"$f":"Intro!B22","v":"Applicant Company Name"}]
["(Health Company)"]
["Planned Premium Volume by Line of Business"]
["(Amounts in Whole Dollars)"]
[]
[{"$f":"Intro!I8","v":"Nebraska"}]
{"$rows_left_out":44}
{"sheet":"NH","index":41,"n_rows":49,"n_cols":13,"rows_kept":49,"cut":false,"hidden":true,"merged":[]}
[{"$f":"Intro!B22","v":"Applicant Company Name"}]
["(Health Company)"]
["Planned Premium Volume by Line of Business"]
["(Amounts in Whole Dollars)"]
[]
[{"$f":"Intro!I9","v":"New Hampshire"}]
{"$rows_left_out":44}
{"sheet":"NJ","index":42,"n_rows":49,"n_cols":13,"rows_kept":49,"cut":false,"hidden":true,"merged":[]}
[{"$f":"Intro!B22","v":"Applicant Company Name"}]
["(Health Company)"]
["Planned Premium Volume by Line of Business"]
["(Amounts in Whole Dollars)"]
[]
[{"$f":"Intro!I10","v":"New Jersey"}]
{"$rows_left_out":44}
{"sheet":"NM","index":43,"n_rows":49,"n_cols":13,"rows_kept":49,"cut":false,"hidden":true,"merged":[]}
[{"$f":"Intro!B22","v":"Applicant Company Name"}]
["(Health Company)"]
["Planned Premium Volume by Line of Business"]
["(Amounts in Whole Dollars)"]
[]
[{"$f":"Intro!I11","v":"New Mexico"}]
{"$rows_left_out":44}
{"sheet":"NV","index":44,"n_rows":49,"n_cols":13,"rows_kept":49,"cut":false,"hidden":true,"merged":[]}
[{"$f":"Intro!B22","v":"Applicant Company Name"}]
["(Health Company)"]
["Planned Premium Volume by Line of Business"]
["(Amounts in Whole Dollars)"]
[]
[{"$f":"Intro!I12","v":"Nevada"}]
{"$rows_left_out":44}
{"sheet":"NY","index":45,"n_rows":49,"n_cols":13,"rows_kept":49,"cut":false,"hidden":true,"merged":[]}
[{"$f":"Intro!B22","v":"Applicant Company Name"}]
["(Health Company)"]
["Planned Premium Volume by Line of Business"]
["(Amounts in Whole Dollars)"]
[]
[{"$f":"Intro!I13","v":"New York"}]
{"$rows_left_out":44}
{"sheet":"OH","index":46,"n_rows":49,"n_cols":13,"rows_kept":49,"cut":false,"hidden":true,"merged":[]}
[{"$f":"Intro!B22","v":"Applicant Company Name"}]
["(Health Company)"]
["Planned Premium Volume by Line of Business"]
["(Amounts in Whole Dollars)"]
[]
[{"$f":"Intro!I14","v":"Ohio"}]
{"$rows_left_out":44}
{"sheet":"OK","index":47,"n_rows":49,"n_cols":13,"rows_kept":49,"cut":false,"hidden":true,"merged":[]}
[{"$f":"Intro!B22","v":"Applicant Company Name"}]
["(Health Company)"]
["Planned Premium Volume by Line of Business"]
["(Amounts in Whole Dollars)"]
[]
[{"$f":"Intro!I15","v":"Oklahoma"}]
{"$rows_left_out":44}
{"sheet":"OR","index":48,"n_rows":49,"n_cols":13,"rows_kept":49,"cut":false,"hidden":true,"merged":[]}
[{"$f":"Intro!B22","v":"Applicant Company Name"}]
["(Health Company)"]
["Planned Premium Volume by Line of Business"]
["(Amounts in Whole Dollars)"]
[]
[{"$f":"Intro!I16","v":"Oregon"}]
{"$rows_left_out":44}
{"sheet":"PA","index":49,"n_rows":49,"n_cols":13,"rows_kept":49,"cut":false,"hidden":true,"merged":[]}
[{"$f":"Intro!B22","v":"Applicant Company Name"}]
["(Health Company)"]
["Planned Premium Volume by Line of Business"]
["(Amounts in Whole Dollars)"]
[]
[{"$f":"Intro!I17","v":"Pennsylvania"}]
{"$rows_left_out":44}
{"sheet":"PR","index":50,"n_rows":49,"n_cols":13,"rows_kept":49,"cut":false,"hidden":true,"merged":[]}
[{"$f":"Intro!B22","v":"Applicant Company Name"}]
["(Health Company)"]
["Planned Premium Volume by Line of Business"]
["(Amounts in Whole Dollars)"]
[]
[{"$f":"Intro!I18","v":"Puerto Rico"}]
{"$rows_left_out":44}
{"sheet":"RI","index":51,"n_rows":49,"n_cols":13,"rows_kept":49,"cut":false,"hidden":true,"merged":[]}
[{"$f":"Intro!B22","v":"Applicant Company Name"}]
["(Health Company)"]
["Planned Premium Volume by Line of Business"]
["(Amounts in Whole Dollars)"]
[]
[{"$f":"Intro!I19","v":"Rhode Island"}]
{"$rows_left_out":44}
{"sheet":"SC","index":52,"n_rows":49,"n_cols":13,"rows_kept":49,"cut":false,"hidden":true,"merged":[]}
[{"$f":"Intro!B22","v":"Applicant Company Name"}]
["(Health Company)"]
["Planned Premium Volume by Line of Business"]
["(Amounts in Whole Dollars)"]
[]
[{"$f":"Intro!I20","v":"South Carolina"}]
{"$rows_left_out":44}
{"sheet":"SD","index":53,"n_rows":49,"n_cols":13,"rows_kept":49,"cut":false,"hidden":true,"merged":[]}
[{"$f":"Intro!B22","v":"Applicant Company Name"}]
["(Health Company)"]
["Planned Premium Volume by Line of Business"]
["(Amounts in Whole Dollars)"]
[]
[{"$f":"Intro!I21","v":"South Dakota"}]
{"$rows_left_out":44}
{"sheet":"TN","index":54,"n_rows":49,"n_cols":13,"rows_kept":49,"cut":false,"hidden":true,"merged":[]}
[{"$f":"Intro!B22","v":"Applicant Company Name"}]
["(Health Company)"]
["Planned Premium Volume by Line of Business"]
["(Amounts in Whole Dollars)"]
[]
[{"$f":"Intro!I22","v":"Tennessee"}]
{"$rows_left_out":44}
{"sheet":"TX","index":55,"n_rows":49,"n_cols":13,"rows_kept":49,"cut":false,"hidden":true,"merged":[]}
[{"$f":"Intro!B22","v":"Applicant Company Name"}]
["(Health Company)"]
["Planned Premium Volume by Line of Business"]
["(Amounts in Whole Dollars)"]
[]
[{"$f":"Intro!I23","v":"Texas"}]
{"$rows_left_out":44}
{"sheet":"UT","index":56,"n_rows":49,"n_cols":13,"rows_kept":49,"cut":false,"hidden":true,"merged":[]}
[{"$f":"Intro!B22","v":"Applicant Company Name"}]
["(Health Company)"]
["Planned Premium Volume by Line of Business"]
["(Amounts in Whole Dollars)"]
[]
[{"$f":"Intro!I24","v":"Utah"}]
{"$rows_left_out":44}
{"sheet":"VA","index":57,"n_rows":49,"n_cols":13,"rows_kept":49,"cut":false,"hidden":true,"merged":[]}
[{"$f":"Intro!B22","v":"Applicant Company Name"}]
["(Health Company)"]
["Planned Premium Volume by Line of Business"]
["(Amounts in Whole Dollars)"]
[]
[{"$f":"Intro!I25","v":"Virginia"}]
{"$rows_left_out":44}
{"sheet":"VI","index":58,"n_rows":49,"n_cols":13,"rows_kept":49,"cut":false,"hidden":true,"merged":[]}
[{"$f":"Intro!B22","v":"Applicant Company Name"}]
["(Health Company)"]
["Planned Premium Volume by Line of Business"]
["(Amounts in Whole Dollars)"]
[]
[{"$f":"Intro!I26","v":"U.S. Virgin Islands"}]
{"$rows_left_out":44}
{"sheet":"VT","index":59,"n_rows":49,"n_cols":13,"rows_kept":49,"cut":false,"hidden":true,"merged":[]}
[{"$f":"Intro!B22","v":"Applicant Company Name"}]
["(Health Company)"]
["Planned Premium Volume by Line of Business"]
["(Amounts in Whole Dollars)"]
[]
[{"$f":"Intro!I27","v":"Vermont"}]
{"$rows_left_out":44}
{"sheet":"WA","index":60,"n_rows":49,"n_cols":13,"rows_kept":49,"cut":false,"hidden":true,"merged":[]}
[{"$f":"Intro!B22","v":"Applicant Company Name"}]
["(Health Company)"]
["Planned Premium Volume by Line of Business"]
["(Amounts in Whole Dollars)"]
[]
[{"$f":"Intro!I28","v":"Washington"}]
{"$rows_left_out":44}
{"sheet":"WI","index":61,"n_rows":49,"n_cols":13,"rows_kept":49,"cut":false,"hidden":true,"merged":[]}
[{"$f":"Intro!B22","v":"Applicant Company Name"}]
["(Health Company)"]
["Planned Premium Volume by Line of Business"]
["(Amounts in Whole Dollars)"]
[]
[{"$f":"Intro!I29","v":"Wisconsin"}]
{"$rows_left_out":44}
{"sheet":"WV","index":62,"n_rows":49,"n_cols":13,"rows_kept":49,"cut":false,"hidden":true,"merged":[]}
[{"$f":"Intro!B22","v":"Applicant Company Name"}]
["(Health Company)"]
["Planned Premium Volume by Line of Business"]
["(Amounts in Whole Dollars)"]
[]
[{"$f":"Intro!I30","v":"West Virginia"}]
{"$rows_left_out":44}
{"sheet":"WY","index":63,"n_rows":49,"n_cols":13,"rows_kept":49,"cut":false,"hidden":true,"merged":[]}
[{"$f":"Intro!B22","v":"Applicant Company Name"}]
["(Health Company)"]
["Planned Premium Volume by Line of Business"]
["(Amounts in Whole Dollars)"]
[]
[{"$f":"Intro!I31","v":"Wyoming"}]
{"$rows_left_out":44}
{"sheet":"Assumptions","index":64,"n_rows":10,"n_cols":1,"rows_kept":10,"cut":false,"hidden":false,"merged":[]}
[]
[]
[]
[]
[]
[]
{"$rows_left_out":4}